Target
Cathepsin D
Ligand
BDBM16056
Substrate
Cathepsin D Peptide Substrate
Meas. Tech.
Enzyme Inhibition Measurements
Temperature
298.15±n/a K
IC50
60±n/a nM
Comments
extracted
Citation
 Hanessian, SYun, HHou, YYang, GBayrakdarian, MTherrien, EMoitessier, NRoggo, SVeenstra, STintelnot-Blomley, MRondeau, JMOstermeier, CStrauss, ARamage, PPaganetti, PNeumann, UBetschart, C Structure-based design, synthesis, and memapsin 2 (BACE) inhibitory activity of carbocyclic and heterocyclic peptidomimetics. J Med Chem 48:5175-90 (2005)  
Target
Name:
Cathepsin D
Synonyms:
CATD_HUMAN CTSD Cathepsin D heavy chain Cathepsin D precursor
Type:
Enzyme
Mol. Mass.:
44551.72
Organism:
Homo sapiens (Human)
Description:
Human proCathepsin D (SwissProt accession number P07339) was expressed in Sf9 cells, purified, and autoactivated.
Residue:
412
  
Inhibitor
Name:
BDBM16056
Synonyms:
(1R,2R)-N-butyl-2-[(1S,2S)-2-[(2S)-2-[(2S)-2-acetamido-4-methylpentanamido]-4-(methylsulfanyl)butanamido]-1-hydroxy-4-methylpentyl]cyclopentane-1-carboxamide truncated OM99-2 cyclopentano analog 50
Type:
Small organic molecule
Emp. Form.:
C29H54N4O5S
Mol. Mass.:
570.828
SMILES:
[H][C@]1(CCC[C@H]1C(=O)NCCCC)[C@H](O)[C@H](CC(C)C)NC(=O)[C@H](CCSC)NC(=O)[C@H](CC(C)C)NC(C)=O
:
Substrate
Name:
Cathepsin D Peptide Substrate
Synonyms:
Type:
Peptide
Mol. Mass.:
2375.29
Organism:
Description:
Peptide substrates were obtained from Bachem (Bubendorf, Switzerland).
Residue:
20