Target
Urokinase-type plasminogen activator
Ligand
BDBM16170
Substrate
BDBM14716
Meas. Tech.
Determination of Inhibitor Potency and Selectivity
Ki
1.6±n/a nM
Citation
 Fish, PVBarber, CGBrown, DGButt, RCollis, MGDickinson, RPHenry, BTHorne, VAHuggins, JPKing, EO'gara, MMcCleverty, DMcIntosh, FPhillips, CWebster, R Selective Urokinase-Type Plasminogen Activator Inhibitors. 4. 1-(7-Sulfonamidoisoquinolinyl)guanidines. J Med Chem 50:2341-51 (2007)  
Target
Name:
Urokinase-type plasminogen activator
Synonyms:
PLAU UROK_HUMAN Urokinase-type plasminogen activator (uPA) | Urokinase-type plasminogen activator/surface receptor
Type:
Enzyme
Mol. Mass.:
48528.62
Organism:
Homo sapiens (Human)
Description:
P00749
Residue:
431
  
Inhibitor
Name:
BDBM16170
Synonyms:
2-(4-chloro-7-{[1-(morpholin-4-ylcarbonyl)cyclopentyl]sulfamoyl}isoquinolin-1-yl)guanidine | cycloleucine deriv. 44
Type:
Small organic molecule
Emp. Form.:
C20H25ClN6O4S
Mol. Mass.:
480.968
SMILES:
[#7]\[#6](-[#7])=[#7]/c1ncc(Cl)c2ccc(cc12)S(=O)(=O)[#7]C1([#6]-[#6]-[#6]-[#6]1)[#6](=O)-[#7]-1-[#6]-[#6]-[#8]-[#6]-[#6]-1
:
Substrate
Name:
BDBM14716
Synonyms:
(2S)-5-carbamimidamido-N-(4-nitrophenyl)-2-(2-{[(2S)-5-oxopyrrolidin-2-yl]formamido}acetamido)pentanamide hydrochloride L-Pyroglutamyl-glycyl-L-argininep-Nitroaniline hydrochloride
Type:
Small organic molecule
Emp. Form.:
C19H26N8O6
Mol. Mass.:
462.4597
SMILES:
[#7]\[#6](-[#7])=[#7]/[#6]-[#6]-[#6]-[#6@H](-[#7]-[#6](=O)-[#6]-[#7]-[#6](=O)-[#6@@H]-1-[#6]-[#6]-[#6](=O)-[#7]-1)-[#6](=O)-[#7]-c1ccc(cc1)-[#7+](-[#8-])=O
: