Target
Sigma intracellular receptor 2
Ligand
BDBM349316
Substrate
Meas. Tech.
Radioligand Binding Assay
Ki
2.70±n/a nM
Citation
 Rishton, GCatalano, SMLook, GC Isoindoline compositions and methods for treating neurodegenerative disease US Patent  US9796672 Publication Date 10/24/2017 
Target
Name:
Sigma intracellular receptor 2
Synonyms:
MAC30 S2R Sigma-2 receptor TMEM97 | Transmembrane protein 97
Type:
Protein
Mol. Mass.:
20857.20
Organism:
Homo sapiens (Human)
Description:
Q5BJF2
Residue:
176
  
Inhibitor
Name:
BDBM349316
Synonyms:
US10207991, Ex. Cpd. No. 5 US11691947, Example 5
Type:
Small organic molecule
Emp. Form.:
C18H17Cl4N
Mol. Mass.:
389.146
SMILES:
C[C@H](CCc1ccc(Cl)c(Cl)c1)N1Cc2cc(Cl)c(Cl)cc2C1
: