Target
Sigma intracellular receptor 2
Ligand
BDBM350897
Substrate
Meas. Tech.
Radioligand Binding Assay
Ki
1.80±n/a nM
Citation
 Rishton, GCatalano, SMLook, GC Isoindoline compositions and methods for treating neurodegenerative disease US Patent  US9796672 Publication Date 10/24/2017 
Target
Name:
Sigma intracellular receptor 2
Synonyms:
MAC30 S2R Sigma-2 receptor TMEM97 | Transmembrane protein 97
Type:
Protein
Mol. Mass.:
20857.20
Organism:
Homo sapiens (Human)
Description:
Q5BJF2
Residue:
176
  
Inhibitor
Name:
BDBM350897
Synonyms:
US9796672, Example Compound 19
Type:
Small organic molecule
Emp. Form.:
C22H21Cl2N
Mol. Mass.:
370.315
SMILES:
C[C@H](CCc1ccc(Cl)c(Cl)c1)N1Cc2ccc3ccccc3c2C1
: