Target
Beta-secretase 1 [22-454]
Ligand
BDBM16290
Substrate
fluorescent substrate FS-2
Meas. Tech.
Enzyme Inhibition Assay
pH
4.5±n/a
Temperature
295.15±n/a K
Ki
3000±920 nM
Citation
 Yang, WLu, WLu, YZhong, MSun, JThomas, AEWilkinson, JMFucini, RVLam, MRandal, MShi, XPJacobs, JWMcDowell, RSGordon, EMBallinger, MD Aminoethylenes: a tetrahedral intermediate isostere yielding potent inhibitors of the aspartyl protease BACE-1. J Med Chem 49:839-42 (2006)  
Target
Name:
Beta-secretase 1 [22-454]
Synonyms:
ASP2 Aspartyl protease 2 BACE1 Beta-site APP cleaving enzyme 1 KIAA1149 Membrane-associated aspartic protease 2 | beta-Secretase (BACE-1)
Type:
Enzyme
Mol. Mass.:
48079.72
Organism:
Homo sapiens (Human)
Description:
C-terminally 6XHis-tagged human proBACE-1 (residues 22-454, numbering starting from the N-terminal methionine) was expressed in Hi5 cells using the baculovirus expression vector pFastbac1 (Invitrogen) and purified on Ni-NTA fast flow resin (Qiagen).
Residue:
433
  
Inhibitor
Name:
BDBM16290
Synonyms:
3-N-[(1R,3S,4S)-3-amino-1-[(4-fluorophenyl)carbamoyl]-1,6-dimethylheptan-4-yl]-1-N,1-N-dipropylbenzene-1,3-dicarboxamide N -[(1S,2S,4R)-2-amino-5-[(4-fluorophenyl)amino]-4-methyl-1-(2-methylpropyl)-5-oxopentyl]-N,N-dipropylbenzene-1,3-dicarboxamide
Type:
Small organic molecule
Emp. Form.:
C30H43FN4O3
Mol. Mass.:
526.6858
SMILES:
CCCN(CCC)C(=O)c1cccc(c1)C(=O)N[C@@H](CC(C)C)[C@@H](N)C[C@@H](C)C(=O)Nc1ccc(F)cc1
:
Substrate
Name:
fluorescent substrate FS-2
Synonyms:
Type:
Peptide
Mol. Mass.:
4309.84
Organism:
Description:
Residue:
42