Target
High affinity nerve growth factor receptor
Ligand
BDBM136597
Substrate
Meas. Tech.
TrkA ELISA Assay
pH
7.5±n/a
IC50
9.70±n/a nM
Comments
extracted
Citation
 Haas, JAndrews, SWJiang, YZhang, G Method of treatment using substituted pyrazolo[1,5-a] pyrimidine compounds US Patent  US10047097 Publication Date 8/14/2018 
Target
Name:
High affinity nerve growth factor receptor
Synonyms:
2.7.10.1 NTRK1 NTRK1_HUMAN Neurotrophic tyrosine kinase receptor type 1 Synonyms=MTC TRK1-transforming tyrosine kinase protein TRKA GN Tropomyosin alpha-3 chain/High affinity nerve growth factor receptor Tropomyosin-related kinase A (TrkA) Tyrosine kinase receptor (Trk) Tyrosine kinase receptor A (Trk A) Tyrosine kinase receptor A (TrkA) p140-TrkA
Type:
Mol. Mass.:
87498.18
Organism:
Homo sapiens (Human)
Description:
P04629
Residue:
796
  
Inhibitor
Name:
BDBM136597
Synonyms:
US10005783, 14 US10774085, Example 14 US11267818, Example 14 US8865698, 14 | US9676783, 14
Type:
Small organic molecule
Emp. Form.:
C21H22F2N6O2
Mol. Mass.:
428.4352
SMILES:
O[C@H]1CCN(C1)C(=O)Nc1cnn2ccc(nc12)N1CCC[C@@H]1c1cc(F)ccc1F
: