Target
Aldo-keto reductase family 1 member A1
Ligand
BDBM16484
Substrate
BDBM16241
Meas. Tech.
Enzyme Inhibition Assay
IC50
13000±n/a nM
Citation
 Van Zandt, MCJones, MLGunn, DEGeraci, LSJones, JHSawicki, DRSredy, JJacot, JLDicioccio, ATPetrova, TMitschler, APodjarny, AD Discovery of 3-[(4,5,7-trifluorobenzothiazol-2-yl)methyl]indole-N-acetic acid (lidorestat) and congeners as highly potent and selective inhibitors of aldose reductase for treatment of chronic diabetic complications. J Med Chem 48:3141-52 (2005)  
Target
Name:
Aldo-keto reductase family 1 member A1
Synonyms:
AK1A1_HUMAN ALDR1 Alcohol dehydrogenase [NADP+] Aldehyde reductase | Aldo-keto reductase family 1 member A1
Type:
Enzyme
Mol. Mass.:
36574.11
Organism:
Homo sapiens (Human)
Description:
Residue:
325
  
Inhibitor
Name:
BDBM16484
Synonyms:
2-{6-methyl-3-[(4,5,7-trifluoro-1,3-benzothiazol-2-yl)methyl]-1H-indol-1-yl}acetic acid | Indoleacetic Acid Inhibitor 40
Type:
Small organic molecule
Emp. Form.:
C19H13F3N2O2S
Mol. Mass.:
390.379
SMILES:
Cc1ccc2c(Cc3nc4c(F)c(F)cc(F)c4s3)cn(CC(O)=O)c2c1
:
Substrate
Name:
BDBM16241
Synonyms:
2,3-dihydroxypropanal Glycerinformal | Glycerose
Type:
Small organic molecule
Emp. Form.:
C3H6O3
Mol. Mass.:
90.0779
SMILES:
OCC(O)C=O
: