Target
RAC-alpha serine/threonine-protein kinase [139-480,S378A,S381A,T450D,S473D]
Ligand
BDBM16534
Substrate
biotinylated Akt peptide substrate
Meas. Tech.
Akt Kinase Assay
pH
7.5±n/a
Temperature
295.15±n/a K
IC50
16±n/a nM
Citation
 Zhu, GDGandhi, VBGong, JThomas, SWoods, KWSong, XLi, TDiebold, RBLuo, YLiu, XGuan, RKlinghofer, VJohnson, EFBouska, JOlson, AMarsh, KCStoll, VSMamo, MPolakowski, JCampbell, TJMartin, RLGintant, GAPenning, TDLi, QRosenberg, SHGiranda, VL Syntheses of potent, selective, and orally bioavailable indazole-pyridine series of protein kinase b/akt inhibitors with reduced hypotension. J Med Chem 50:2990-3003 (2007)  
Target
Name:
RAC-alpha serine/threonine-protein kinase [139-480,S378A,S381A,T450D,S473D]
Synonyms:
AKT1 C-AKT Protein kinase B (Akt 1) RAC | RAC-PK-alpha
Type:
Enzyme
Mol. Mass.:
39513.28
Organism:
Homo sapiens (Human)
Description:
Recombinant His-tagged Akt1 (S378A, S381A, T450D, S473D; 139-480)
Residue:
342
  
Inhibitor
Name:
BDBM16534
Synonyms:
(3Z)-5-(5-{[(2S)-2-amino-3-phenylpropyl]oxy}pyridin-3-yl)-3-(1H-pyrrol-2-ylmethylidene)-1,3-dihydro-2H-indol-2-one oxindole-pyridine, 35
Type:
Small organic molecule
Emp. Form.:
C27H24N4O2
Mol. Mass.:
436.5051
SMILES:
N[C@H](COc1cncc(c1)-c1ccc2NC(=O)\C(=C/c3ccc[nH]3)c2c1)Cc1ccccc1
:
Substrate
Name:
biotinylated Akt peptide substrate
Synonyms:
Type:
Biotinylated Peptide
Mol. Mass.:
3178.04
Organism:
Description:
Km=15 uM
Residue:
28