Target
Carbonic anhydrase 2
Ligand
BDBM16661
Substrate
BDBM11326
Meas. Tech.
Esterase Assay
Ki
9±n/a nM
Citation
 Vullo, DFranchi, MGallori, EAntel, JScozzafava, ASupuran, CT Carbonic anhydrase inhibitors. Inhibition of mitochondrial isozyme V with aromatic and heterocyclic sulfonamides. J Med Chem 47:1272-9 (2004)  
Target
Name:
Carbonic anhydrase 2
Synonyms:
CA-II CAC Carbonate dehydratase II Carbonic anhydrase 2 (CA-II) Carbonic anhydrase C Carbonic anhydrase II (CA-II) Carbonic anhydrase II (hCA II) | Carbonic anhydrase isoenzyme II (hCA II)
Type:
Enzyme
Mol. Mass.:
29250.71
Organism:
Homo sapiens (Human)
Description:
P00918
Residue:
260
  
Inhibitor
Name:
BDBM16661
Synonyms:
1-N-(4-fluorobenzene)benzene-1,4-disulfonamide | aromatic sulfonamide compound 26
Type:
Small organic molecule
Emp. Form.:
C12H11FN2O4S2
Mol. Mass.:
330.355
SMILES:
NS(=O)(=O)c1ccc(NS(=O)(=O)c2ccc(F)cc2)cc1
:
Substrate
Name:
BDBM11326
Synonyms:
4-nitrophenyl acetate | p-Nitrophenyl Acetate
Type:
Small organic molecule
Emp. Form.:
C8H7NO4
Mol. Mass.:
181.1455
SMILES:
CC(=O)Oc1ccc(cc1)[N+]([O-])=O
: