Target
Carbonic anhydrase 5A, mitochondrial
Ligand
BDBM10857
Substrate
BDBM10856
Meas. Tech.
Esterase Assay
Ki
1360±n/a nM
Citation
 Vullo, DFranchi, MGallori, EAntel, JScozzafava, ASupuran, CT Carbonic anhydrase inhibitors. Inhibition of mitochondrial isozyme V with aromatic and heterocyclic sulfonamides. J Med Chem 47:1272-9 (2004)  
Target
Name:
Carbonic anhydrase 5A, mitochondrial
Synonyms:
CAH5A_MOUSE Ca5a Car5a Carbonic Anhydrase V Carbonic anhydrase 5A, mitochondrial precursor
Type:
Enzyme
Mol. Mass.:
34081.17
Organism:
Mus musculus (mouse)
Description:
Full length murine, cloned isozyme.
Residue:
299
  
Inhibitor
Name:
BDBM10857
Synonyms:
4-aminobenzene-1-sulfonamide Sulfanilamide aromatic/heteroaromatic sulfonamide 2 | halogenosulfanilamide deriv. 5a
Type:
Small organic molecule
Emp. Form.:
C6H8N2O2S
Mol. Mass.:
172.205
SMILES:
Nc1ccc(cc1)S(N)(=O)=O
:
Substrate
Name:
BDBM10856
Synonyms:
Carbon Dioxide | methanedione
Type:
Small organic molecule
Emp. Form.:
CO2
Mol. Mass.:
44.0095
SMILES:
O=C=O
: