Target
Membrane primary amine oxidase
Ligand
BDBM228085
Substrate
Vascular adhesion protein 1 (VAP-1)
Meas. Tech.
Radiochemistry Enzymatic Assay
Temperature
298.15±n/a K
IC50
1.70±n/a nM
Comments
extracted
Citation
 Yoshihara, KSuzuki, DYamaki, SYamada, HMihara, HSeki, N Guanidine compound US Patent  US9556160 Publication Date 1/31/2017 
Target
Name:
Membrane primary amine oxidase
Synonyms:
AOC3_RAT Aoc3 Vascular adhesion protein 1 (VAP-1)
Type:
Enzyme
Mol. Mass.:
84979.78
Organism:
Rattus norvegicus (Rat)
Description:
O08590
Residue:
763
  
Inhibitor
Name:
BDBM228085
Synonyms:
US9556160, ex 300
Type:
Small organic molecule
Emp. Form.:
C20H24FN5O2
Mol. Mass.:
385.4353
SMILES:
Cc1ccc(cn1)N1CCN(CC1)c1cccc(COC(=O)CC(N)=N)c1F
:
Substrate
Name:
Membrane primary amine oxidase
Synonyms:
AOC3_RAT Aoc3 Vascular adhesion protein 1 (VAP-1)
Type:
Enzyme
Mol. Mass.:
84979.78
Organism:
Rattus norvegicus (Rat)
Description:
O08590
Residue:
763