Target
Membrane primary amine oxidase
Ligand
BDBM228087
Substrate
Vascular adhesion protein 1 (VAP-1)
Meas. Tech.
Radiochemistry Enzymatic Assay
Temperature
298.15±n/a K
IC50
0.900±n/a nM
Comments
extracted
Citation
 Yoshihara, KSuzuki, DYamaki, SYamada, HMihara, HSeki, N Guanidine compound US Patent  US9556160 Publication Date 1/31/2017 
Target
Name:
Membrane primary amine oxidase
Synonyms:
AOC3_RAT Aoc3 Vascular adhesion protein 1 (VAP-1)
Type:
Enzyme
Mol. Mass.:
84979.78
Organism:
Rattus norvegicus (Rat)
Description:
O08590
Residue:
763
  
Inhibitor
Name:
BDBM228087
Synonyms:
US9556160, ex 316
Type:
Small organic molecule
Emp. Form.:
C22H28FN7O3
Mol. Mass.:
457.5012
SMILES:
COC1CN(C1)c1ncc(cn1)N1CCN(CC1)c1cccc(COC(=O)CC(N)=N)c1F
:
Substrate
Name:
Membrane primary amine oxidase
Synonyms:
AOC3_RAT Aoc3 Vascular adhesion protein 1 (VAP-1)
Type:
Enzyme
Mol. Mass.:
84979.78
Organism:
Rattus norvegicus (Rat)
Description:
O08590
Residue:
763