Target
Beta-secretase 2
Ligand
BDBM16751
Substrate
BACE Peptide Substrate
Meas. Tech.
FRET-based Peptide Cleavage Assay
pH
4.5±n/a
Temperature
295.15±n/a K
IC50
>50000±n/a nM
Citation
 Cole, DCManas, ESStock, JRCondon, JSJennings, LDAulabaugh, AChopra, RCowling, REllingboe, JWFan, KYHarrison, BLHu, YJacobsen, SJin, GLin, LLovering, FEMalamas, MSStahl, MLStrand, JSukhdeo, MNSvenson, KTurner, MJWagner, EWu, JZhou, PBard, J Acylguanidines as small-molecule beta-secretase inhibitors. J Med Chem 49:6158-61 (2006)  
Target
Name:
Beta-secretase 2
Synonyms:
AEPLC ASP1 Asp 1 Aspartyl protease 1 BACE2_HUMAN Beta-secretase (BACE) Beta-secretase 2 (BACE-2) Beta-site APP-cleaving enzyme 2 Memapsin-1 beta-Secretase (BACE-2)
Type:
Protein
Mol. Mass.:
56171.20
Organism:
Homo sapiens (Human)
Description:
Q9Y5Z0
Residue:
518
  
Inhibitor
Name:
BDBM16751
Synonyms:
(N-(diaminomethylene)-2,4-diphenyl-1H-pyrrole-1-acetamide) CHEMBL217068 | N-(diaminomethylidene)-2-(2,5-diphenyl-1H-pyrrol-1-yl)acetamide
Type:
Small organic molecule
Emp. Form.:
C19H18N4O
Mol. Mass.:
318.3724
SMILES:
NC(=N)NC(=O)Cn1c(ccc1-c1ccccc1)-c1ccccc1
:
Substrate
Name:
BACE Peptide Substrate
Synonyms:
Swedish substrate
Type:
Peptide
Mol. Mass.:
1530.57
Organism:
Description:
Residue:
14
ASEVNLDAEFRDPA