Target
cAMP-dependent protein kinase catalytic subunit alpha
Ligand
BDBM16794
Substrate
biotinylated kemptide
Meas. Tech.
Akt Kinase Assay
IC50
32±n/a nM
Citation
 Zhu, GDGong, JGandhi, VBWoods, KLuo, YLiu, XGuan, RKlinghofer, VJohnson, EFStoll, VSMamo, MLi, QRosenberg, SHGiranda, VL Design and synthesis of pyridine-pyrazolopyridine-based inhibitors of protein kinase B/Akt. Bioorg Med Chem 15:2441-52 (2007)  
Target
Name:
cAMP-dependent protein kinase catalytic subunit alpha
Synonyms:
KAPCA_BOVIN PKC Protein Kinase C cAMP-Dependent Protein Kinase (PKA) cAMP-dependent protein kinase A cAMP-dependent protein kinase, alpha-catalytic subunit
Type:
Enzyme Complex
Mol. Mass.:
40627.77
Organism:
Bos taurus (bovine)
Description:
The PKA holoenzyme purified from bovine heart, exists as an inactive tetrameric complex, which consists of a regulatory dimer associated with two catalytic subunits. It requires cAMP to activate the enzymatic reaction.
Residue:
351
  
Inhibitor
Name:
BDBM16794
Synonyms:
3-[(2S)-2-amino-3-phenylpropoxy]-5-{3-ethenyl-1H-pyrazolo[3,4-c]pyridin-5-yl}pyridine | pyrazolopyridine analog, 25a
Type:
Small organic molecule
Emp. Form.:
C22H21N5O
Mol. Mass.:
371.435
SMILES:
N[C@H](COc1cncc(c1)-c1cc2c(C=C)n[nH]c2cn1)Cc1ccccc1
:
Substrate
Name:
biotinylated kemptide
Synonyms:
Type:
Biotinylated Peptide
Mol. Mass.:
1353.09
Organism:
Description:
Residue:
12
ITINHLRRASLG