Target
Estrogen receptor
Ligand
BDBM158505
Substrate
Estrogen receptor beta
Meas. Tech.
In Vitro Assay
pH
7.5±n/a
Ki
4.9±n/a nM
Comments
extracted
Citation
 Coelingh Bennink, HJBunschoten, EJ Pharmaceutical compositions comprising estetrol derivatives for use in cancer therapy US Patent  US9561238 Publication Date 2/7/2017 
Target
Name:
Estrogen receptor
Synonyms:
ER ESR ESR1_HUMAN Estrogen receptor Estrogen receptor (ER-alpha) Estrogen receptor alpha (ER) Nuclear receptor subfamily 3 group A member 1
Type:
Protein
Mol. Mass.:
66230.44
Organism:
Homo sapiens (Human)
Description:
P03372
Residue:
595
  
Inhibitor
Name:
BDBM158505
Synonyms:
US9034854, E4 US9561238, E4
Type:
Small organic molecule
Emp. Form.:
C18H24O4
Mol. Mass.:
304.3808
SMILES:
C[C@]12CC[C@H]3[C@@H](CCc4cc(O)ccc34)[C@@H]1[C@@H](O)[C@@H](O)[C@@H]2O
:
Substrate
Name:
Estrogen receptor beta
Synonyms:
ER-beta ESR2_HUMAN Estradiol receptor beta (ERβ) Estrogen receptor (ER beta) Estrogen receptor beta (ER beta) NR3A2 estrogen beta
Type:
Protein
Mol. Mass.:
59238.43
Organism:
Homo sapiens (Human)
Description:
Q92731
Residue:
530