Target
Coagulation factor X
Ligand
BDBM17101
Substrate
BDBM12658
Meas. Tech.
Enzyme Inhibition Assay
pH
7.5±n/a
Temperature
295.15±n/a K
Ki
0.71±n/a nM
Citation
 Ye, BArnaiz, DOChou, YLGriedel, BDKaranjawala, RLee, WMorrissey, MMSacchi, KLSakata, STShaw, KJWu, SCZhao, ZAdler, MCheeseman, SDole, WPEwing, JFitch, RLentz, DLiang, ALight, DMorser, JPost, JRumennik, GSubramanyam, BSullivan, MEVergona, RWalters, JWang, YXWhite, KAWhitlow, MKochanny, MJ Thiophene-anthranilamides as highly potent and orally available factor xa inhibitors J Med Chem 50:2967-80 (2007)  
Target
Name:
Coagulation factor X
Synonyms:
Activated coagulation factor X (FXa) Coagulation factor X precursor F10 Factor X heavy chain Factor Xa Stuart-Prower factor
Type:
Enzyme
Mol. Mass.:
54726.60
Organism:
Homo sapiens (Human)
Description:
Residue:
488
  
Inhibitor
Name:
BDBM17101
Synonyms:
3-chloro-N-{4-chloro-2-[(5-chloropyridin-2-yl)carbamoyl]-6-methoxyphenyl}-4-{[(2-hydroxy-2-methylpropyl)(methyl)amino]methyl}thiophene-2-carboxamide | Thiophene-Anthranilamide, 10m
Type:
Small organic molecule
Emp. Form.:
C24H25Cl3N4O4S
Mol. Mass.:
571.904
SMILES:
COc1cc(Cl)cc(C(=O)Nc2ccc(Cl)cn2)c1NC(=O)c1scc(CN(C)CC(C)(C)O)c1Cl
:
Substrate
Name:
BDBM12658
Synonyms:
4-[({[(1S)-4-carbamimidamido-1-[(4-nitrophenyl)carbamoyl]butyl]carbamoyl}methyl)carbamoyl]-4-[(2S,3S)-3-methyl-2-(phenylformamido)pentanamido]butanoic acid hydrochloride Chromogenic Substrate S-2222 benzoyl-Ile-Glu-Gly-Arg-p-nitroanilide
Type:
Small organic molecule
Emp. Form.:
C32H43N9O9
Mol. Mass.:
697.7387
SMILES:
[#6]-[#6]-[#6@H](-[#6])-[#6@H](-[#7]-[#6](=O)-c1ccccc1)-[#6](=O)-[#7]-[#6@@H](-[#6]-[#6]-[#6](-[#8])=O)-[#6](=O)-[#7]-[#6]-[#6](=O)-[#7]-[#6@@H](-[#6]-[#6]-[#6]\[#7]=[#6](\[#7])-[#7])-[#6](=O)-[#7]-c1ccc(cc1)-[#7+](-[#8-])=O
: