Target
Cyclin-A2/Cyclin-dependent kinase 1
Ligand
BDBM17054
Substrate
biotinylated CDK peptide substrate
Meas. Tech.
CDK Activity Assay.
pH
7.4±n/a
Temperature
295.15±n/a K
Ki
95±22 nM
Comments
The apparent Km for ATP in the CDK1 assay was about 31 uM.
Citation
 Zhao, BBower, MJMcDevitt, PJZhao, HDavis, STJohanson, KOGreen, SMConcha, NOZhou, BB Structural basis for Chk1 inhibition by UCN-01. J Biol Chem 277:46609-15 (2002)  
Target
Name:
Cyclin-A2/Cyclin-dependent kinase 1
Synonyms:
CDK1/Cyclin A | Cyclin-Dependent Kinase 1 (CDK1)
Type:
Protein Complex
Mol. Mass.:
Description:
CDK1 was expressed in a baculovirus expression system and was partially purified. Cyclin A was purified separately and mixed with CDK1 before assays.
Components:
This complex has 2 components.
Component 1
Name:
Cyclin-dependent kinase 1
Synonyms:
CDC2 CDK1 CDKN1 Cell division protein kinase 1 P34CDC2 | p34 protein kinase
Type:
Enzyme Subunit
Mol. Mass.:
34101.08
Organism:
Homo sapiens (Human)
Description:
P06493
Residue:
297
  
Component 2
Name:
Cyclin-A2
Synonyms:
CCN1 CCNA1 CCNA2_HUMAN Cyclin-A
Type:
Enzyme Subunit
Mol. Mass.:
48550.19
Organism:
Homo sapiens (Human)
Description:
P20248
Residue:
432
  
Inhibitor
Name:
BDBM17054
Synonyms:
(2S,3R,4R,6R,18R)-18-hydroxy-3-methoxy-2-methyl-4-(methylamino)-29-oxa-1,7,17-triazaoctacyclo[12.12.2.1^{2,6}.0^{7,28}.0^{8,13}.0^{15,19}.0^{20,27}.0^{21,26}]nonacosa-8,10,12,14,19,21,23,25,27-nonaen-16-one 7-Hydroxystaurosporine | UCN-01
Type:
Small organic molecule
Emp. Form.:
C28H26N4O4
Mol. Mass.:
482.5304
SMILES:
[H][C@]12C[C@@H](NC)[C@@H](OC)[C@](C)(O1)n1c3ccccc3c3c4[C@@H](O)NC(=O)c4c4c5ccccc5n2c4c13
:
Substrate
Name:
biotinylated CDK peptide substrate
Synonyms:
Type:
Peptide
Mol. Mass.:
2939.48
Organism:
Description:
Residue:
25