Target
Cyclin-A2/Cyclin-dependent kinase 2
Ligand
BDBM17140
Substrate
biotinylated CDK peptide substrate
Meas. Tech.
CDK Activity Assay.
pH
7.4±n/a
Temperature
295.15±n/a K
Ki
5.6±0.9 nM
Comments
The apparent Km for ATP in the CDK2 assay was about 31 uM.
Citation
 Zhao, BBower, MJMcDevitt, PJZhao, HDavis, STJohanson, KOGreen, SMConcha, NOZhou, BB Structural basis for Chk1 inhibition by UCN-01. J Biol Chem 277:46609-15 (2002)  
Target
Name:
Cyclin-A2/Cyclin-dependent kinase 2
Synonyms:
CDK2-CyclinA CDK2/Cyclin A Cyclin A2/dependent kinase 2 Cyclin-Dependent Kinase 2 (CDK2A)
Type:
Protein Complex
Mol. Mass.:
Description:
Cdk2/Cyclin A kinase was purified from insect cells coinfected with Cyclin A/Cdk2 baculovirus.
Components:
This complex has 2 components.
Component 1
Name:
Cyclin-dependent kinase 2
Synonyms:
CDK2 CDK2_HUMAN Cell division protein kinase 2 Protein cereblon/Cyclin-dependent kinase 2 | p33 protein kinase
Type:
Enzyme Subunit
Mol. Mass.:
33938.17
Organism:
Homo sapiens (Human)
Description:
P24941
Residue:
298
  
Component 2
Name:
Cyclin-A2
Synonyms:
CCN1 CCNA1 CCNA2_HUMAN Cyclin-A
Type:
Enzyme Subunit
Mol. Mass.:
48550.19
Organism:
Homo sapiens (Human)
Description:
P20248
Residue:
432
  
Inhibitor
Name:
BDBM17140
Synonyms:
(15R,18R)-28-oxa-4,14,19-triazaoctacyclo[12.11.2.1^{15,18}.0^{2,6}.0^{7,27}.0^{8,13}.0^{19,26}.0^{20,25}]octacosa-1,6,8(13),9,11,20(25),21,23,26-nonaene-3,5-dione SB-218078 | SB218078
Type:
Small organic molecule
Emp. Form.:
C24H15N3O3
Mol. Mass.:
393.3942
SMILES:
O=C1NC(=O)c2c1c1c3ccccc3n3[C@H]4CC[C@@H](O4)n4c5ccccc5c2c4c13
:
Substrate
Name:
biotinylated CDK peptide substrate
Synonyms:
Type:
Peptide
Mol. Mass.:
2939.48
Organism:
Description:
Residue:
25