Target
Aldo-keto reductase family 1 member C3
Ligand
BDBM17285
Substrate
BDBM8885
Meas. Tech.
Inhibition Study on the Interconversion of Testosterone to Androstenedione (4-dione)
pH
7.5±n/a
Temperature
310.15±0.5 K
Ki
6.9±1.4 nM
Citation
 Qiu, WZhou, MMazumdar, MAzzi, AGhanmi, DLuu-The, VLabrie, FLin, SX Structure-based inhibitor design for an enzyme that binds different steroids: a potent inhibitor for human type 5 17beta-hydroxysteroid dehydrogenase. J Biol Chem 282:8368-79 (2007)  
Target
Name:
Aldo-keto reductase family 1 member C3
Synonyms:
17-beta-Hydroxysteroid Dehydrogenase 5 (17-beta-HSD5, AKR1C3) AK1C3_HUMAN Aldo-keto reductase family 1 member C3 Aldo-keto reductase family 1 member C3 (AK1C3a) Aldo-keto-reductase family 1 member C3 Dihydrodiol dehydrogenase 3 Estradiol 17-beta-dehydrogenase KIAA0119 Prostaglandin F synthase Trans-1,2-dihydrobenzene-1,2-diol dehydrogenase
Type:
Enzyme
Mol. Mass.:
36859.86
Organism:
Homo sapiens (Human)
Description:
P42330
Residue:
323
  
Inhibitor
Name:
BDBM17285
Synonyms:
(2R,15'S)-5,5,15'-trimethyl-6-oxospiro[oxane-2,14'-tetracyclo[8.7.0.0^{2,7}.0^{11,15}]heptadecane]-2',4',6'-triene-5'-carboxamide | EM-1404
Type:
Small organic molecule
Emp. Form.:
C25H33NO3
Mol. Mass.:
395.5344
SMILES:
C[C@]12CCC3C(CCc4cc(ccc34)C(N)=O)C1CC[C@@]21CCC(C)(C)C(=O)O1
:
Substrate
Name:
BDBM8885
Synonyms:
(1S,2R,10R,11S,14S,15S)-14-hydroxy-2,15-dimethyltetracyclo[8.7.0.0^{2,7}.0^{11,15}]heptadec-6-en-5-one Testosterone US9682960, Testosterone
Type:
Steroid
Emp. Form.:
C19H28O2
Mol. Mass.:
288.4244
SMILES:
[H][C@@]12CC[C@H](O)[C@@]1(C)CC[C@@]1([H])[C@@]2([H])CCC2=CC(=O)CC[C@]12C
: