Target
Mucosa-associated lymphoid tissue lymphoma translocation protein 1
Ligand
BDBM355969
Substrate
Meas. Tech.
Biochemical Assay
IC50
0.001±n/a nM
Citation
 Soldermann, CPQuancard, JSchlapbach, ASimic, OTintelnot-Blomley, MZoller, T Pyrazolo pyrimidine derivatives and their use as MALT1 inhibitors US Patent  US9815842 Publication Date 11/14/2017 
Target
Name:
Mucosa-associated lymphoid tissue lymphoma translocation protein 1
Synonyms:
MALT lymphoma-associated translocation MALT1 MLT Paracaspase
Type:
Enzyme
Mol. Mass.:
92257.81
Organism:
Homo sapiens (Human)
Description:
Q9UDY8
Residue:
824
  
Inhibitor
Name:
BDBM355969
Synonyms:
(S)-1-(5-chloro-6- (difluoromethoxy) pyridin-3-yl)-3-(2- chloro-7-(1- methoxyethyl)pyrazo- lo[1,5-a]pyrimidin-6- yl)urea US9815842, Example 93
Type:
Small organic molecule
Emp. Form.:
C16H14Cl2F2N6O3
Mol. Mass.:
447.224
SMILES:
CO[C@@H](C)c1c(NC(=O)Nc2cnc(OC(F)F)c(Cl)c2)cnc2cc(Cl)nn12
: