Target
Methionine aminopeptidase 2
Ligand
BDBM17414
Substrate
BDBM17353
Meas. Tech.
Enzyme Inhibition Assay
Ki
0.9±n/a nM
Citation
 Marino, JPFisher, PWHofmann, GAKirkpatrick, RBJanson, CAJohnson, RKMa, CMattern, MMeek, TDRyan, MDSchulz, CSmith, WWTew, DGTomazek, TAVeber, DFXiong, WCYamamoto, YYamashita, KYang, GThompson, SK Highly potent inhibitors of methionine aminopeptidase-2 based on a 1,2,4-triazole pharmacophore. J Med Chem 50:3777-85 (2007)  
Target
Name:
Methionine aminopeptidase 2
Synonyms:
Initiation factor 2-associated 67 kDa glycoprotein MAP2_HUMAN MNPEP Methionine aminopeptidase 2 (MetAP2) P67EIF2 p67
Type:
Enzyme
Mol. Mass.:
52884.45
Organism:
Homo sapiens (Human)
Description:
P50579
Residue:
478
  
Inhibitor
Name:
BDBM17414
Synonyms:
1,2,4-Triazole Compound, 72 | methyl 4-({5-[(pyridin-4-ylmethyl)sulfanyl]-4H-1,2,4-triazol-3-yl}amino)benzoate
Type:
Small organic molecule
Emp. Form.:
C16H15N5O2S
Mol. Mass.:
341.388
SMILES:
COC(=O)c1ccc(Nc2nnc(SCc3ccncc3)[nH]2)cc1
:
Substrate
Name:
BDBM17353
Synonyms:
(2S)-2-amino-N-(4-methyl-2-oxo-2H-chromen-7-yl)-4-(methylsulfanyl)butanamide Met-AMC
Type:
Small organic molecule
Emp. Form.:
C15H18N2O3S
Mol. Mass.:
306.38
SMILES:
CSCC[C@H](N)C(=O)Nc1ccc2c(C)cc(=O)oc2c1
: