Target
High affinity nerve growth factor receptor
Ligand
BDBM356096
Substrate
Meas. Tech.
Functional Activity Assay
IC50
0.083±n/a nM
Citation
 Mitchell, HFraley, MECooke, AJStump, CAChen, YZhang, XMcComas, CCSchirripa, KMcWherter, MMercer, SPBabaoglu, KMeng, DWu, JLiu, PWood, HBBao, JLi, CSMao, QQi, Z TrkA kinase inhibitors, compositions and methods thereof US Patent  US9815846 Publication Date 11/14/2017 
Target
Name:
High affinity nerve growth factor receptor
Synonyms:
2.7.10.1 NTRK1 NTRK1_HUMAN Neurotrophic tyrosine kinase receptor type 1 Synonyms=MTC TRK1-transforming tyrosine kinase protein TRKA GN Trk-A Tropomyosin-related kinase A Tyrosine kinase receptor Tyrosine kinase receptor A Tyrosine kinase receptor A (Trk-A) gp140trk | p140-TrkA
Type:
Mol. Mass.:
87498.18
Organism:
Homo sapiens (Human)
Description:
P04629
Residue:
796
  
Inhibitor
Name:
BDBM356096
Synonyms:
N-(2-((2,5-dioxoimidazolidin-1- yl)methyl)-4-phenylpyrimidin-5- yl)-2-fluoro-5-(1-methyl-1H- pyrazol-3-yl)-4- (trifluoromethyl)benzamide | US9815846, Compound 96
Type:
Small organic molecule
Emp. Form.:
C26H19F4N7O3
Mol. Mass.:
553.4678
SMILES:
Cn1ccc(n1)-c1cc(C(=O)Nc2cnc(CN3C(=O)CNC3=O)nc2-c2ccccc2)c(F)cc1C(F)(F)F
: