Target
Protein O-GlcNAcase
Ligand
BDBM205423
Substrate
Meas. Tech.
Inhibition Assay
Ki
0.500±n/a nM
Citation
 Kaul, RMcEachern, EJMu, CSelnick, HGVocadlo, DJWang, YWei, ZZhou, YZhu, Y Selective glycosidase inhibitors and uses thereof US Patent  US9815861 Publication Date 11/14/2017 
Target
Name:
Protein O-GlcNAcase
Synonyms:
2-acetamido-2-deoxy-β-D-glucopyranosidase (O-GlcNAcase) Beta-hexosaminidase (O-GlcNAcase) HEXC MEA5 N-acetyl-beta-D-glucosaminidase (O-GlcNAcase) OGA Protein O-GlcNAcase
Type:
Enzyme
Mol. Mass.:
102874.67
Organism:
Homo sapiens (Human)
Description:
O60502
Residue:
916
  
Inhibitor
Name:
BDBM205423
Synonyms:
US9243020, 17 | US9815861, Example 17
Type:
Small organic molecule
Emp. Form.:
C8H13FN2O3S
Mol. Mass.:
236.264
SMILES:
CNC1=N[C@H]2[C@H](O[C@H](CF)[C@@H](O)[C@@H]2O)S1
: