Target
Tyrosine-protein kinase Lck
Ligand
BDBM17746
Substrate
biotinylated gastrin substrate
Meas. Tech.
HTRF Kinase Inhibition Assay
pH
7.5±n/a
Temperature
295.15±n/a K
IC50
2±n/a nM
Citation
 Martin, MWNewcomb, JNunes, JJMcGowan, DCArmistead, DMBoucher, CBuchanan, JLBuckner, WChai, LElbaum, DEpstein, LFFaust, TFlynn, SGallant, PGore, AGu, YHsieh, FHuang, XLee, JHMetz, DMiddleton, SMohn, DMorgenstern, KMorrison, MJNovak, PMOliveira-dos-Santos, APowers, DRose, PSchneider, SSell, STudor, YTurci, SMWelcher, AAWhite, RDZack, DZhao, HZhu, LZhu, XGhiron, CAmouzegh, PErmann, MJenkins, JJohnston, DNapier, SPower, E Novel 2-aminopyrimidine carbamates as potent and orally active inhibitors of Lck: synthesis, SAR, and in vivo antiinflammatory activity. J Med Chem 49:4981-91 (2006)  
Target
Name:
Tyrosine-protein kinase Lck
Synonyms:
2.7.10.2 LCK_HUMAN Leukocyte C-terminal Src kinase Lymphocyte-specific protein tyrosine kinase Protein YT16 Proto-oncogene tyrosine-protein kinase LCK T cell-specific protein-tyrosine kinase
Type:
Mol. Mass.:
57987.83
Organism:
Homo sapiens (Human)
Description:
P06239
Residue:
509
  
Inhibitor
Name:
BDBM17746
Synonyms:
2,6-dimethylphenyl N-(2,4-dimethoxyphenyl)-N-[2-({3-fluoro-4-[3-(piperidin-1-yl)propoxy]phenyl}amino)pyrimidin-4-yl]carbamate | 2-aminopyrimidine carbamate, 45
Type:
Small organic molecule
Emp. Form.:
C35H40FN5O5
Mol. Mass.:
629.721
SMILES:
COc1ccc(N(C(=O)Oc2c(C)cccc2C)c2ccnc(Nc3ccc(OCCCN4CCCCC4)c(F)c3)n2)c(OC)c1
:
Substrate
Name:
biotinylated gastrin substrate
Synonyms:
Type:
Peptide
Mol. Mass.:
2100.22
Organism:
Description:
Residue:
17
ITINYLEEEEAYGWLDF