Target
Lysine-specific histone demethylase 1A
Ligand
BDBM151605
Substrate
Meas. Tech.
LSD1 Histone Demethylase Assay
IC50
218±n/a nM
Citation
 Vankayalapati, HSorna, VWarner, SLStephens, BBearss, DJSharma, S Substituted (E)-N′-(1-phenylethylidene)benzohydrazide analogs as histone demethylase inhibitors US Patent  US9555024 Publication Date 1/31/2017 
Target
Name:
Lysine-specific histone demethylase 1A
Synonyms:
AOF2 Flavin-containing amine oxidase domain-containing protein 2 KDM1A KIAA0601 Lysine-specific demethylase 1 (LSD1) Lysine-specific histone demethylase 1 (LSD1)
Type:
Enzyme
Mol. Mass.:
92901.01
Organism:
Homo sapiens (Human)
Description:
O60341
Residue:
852
  
Inhibitor
Name:
BDBM151605
Synonyms:
US8987335, 1 | US9555024, 1
Type:
Small organic molecule
Emp. Form.:
C14H12N2O3
Mol. Mass.:
256.2567
SMILES:
Oc1ccc(cc1)C(=O)N\N=C\c1ccccc1O
: