Target
Glutamate--tRNA ligase
Ligand
BDBM18118
Substrate
BDBM17657
Meas. Tech.
Determination of the Inhibition Type and Constant (Ki)
pH
7.2±n/a
Temperature
310.15±n/a K
Ki
18000±n/a nM
Km
113000±n/a nM
Comments
Competitive inhibition
Citation
 Balg, CBlais, SPBernier, SHuot, JLCouture, MLapointe, JChênevert, R Synthesis of beta-ketophosphonate analogs of glutamyl and glutaminyl adenylate, and selective inhibition of the corresponding bacterial aminoacyl-tRNA synthetases. Bioorg Med Chem 15:295-304 (2007)  
Target
Name:
Glutamate--tRNA ligase
Synonyms:
Glutamate--tRNA ligase SYE_ECOLI tRNA synthetase (GluRS)
Type:
Enzyme
Mol. Mass.:
53807.55
Organism:
Escherichia coli
Description:
His6-tagged clone expressed in E. coli.
Residue:
471
  
Inhibitor
Name:
BDBM18118
Synonyms:
(4S)-4-amino-6-({[(2R,3S,4R,5R)-5-(6-amino-9H-purin-9-yl)-3,4-dihydroxyoxolan-2-yl]methoxy}(hydroxy)phosphoryl)-5-oxohexanoic acid beta-ketophosphonate analogue
Type:
Small organic molecule
Emp. Form.:
C16H23N6O9P
Mol. Mass.:
474.3624
SMILES:
N[C@@H](CCC(O)=O)C(=O)CP(O)(=O)OC[C@H]1O[C@H]([C@H](O)[C@@H]1O)n1cnc2c(N)ncnc12
:
Substrate
Name:
BDBM17657
Synonyms:
(2S)-2-aminopentanedioic acid D-Glutamate L-Glu L-Glutamic acid L-gluatmate
Type:
Amino Acid
Emp. Form.:
C5H9NO4
Mol. Mass.:
147.1293
SMILES:
N[C@@H](CCC(O)=O)C(O)=O
: