Target
Dihydrofolate reductase
Ligand
BDBM18253
Substrate
BDBM18044
Meas. Tech.
Dihydrofolate Reductase (DHFR) Assay
pH
7.4±n/a
Temperature
303.15±n/a K
IC50
140±n/a nM
Citation
 Gangjee, AZeng, YTalreja, TMcGuire, JJKisliuk, RLQueener, SF Design and Synthesis of Classical and Nonclassical 6-Arylthio-2,4-diamino-5-ethylpyrrolo[2,3-d]pyrimidines as Antifolates. J Med Chem 50:3046-3053 (2007)  
Target
Name:
Dihydrofolate reductase
Synonyms:
Bacterial dihydrofolate reductase Dihydrofolate Reductase (DHFR) folA | tmrA
Type:
Enzyme
Mol. Mass.:
17991.61
Organism:
Escherichia coli
Description:
E. coli DHFR was expressed in BL21, and purified to homogeneity.
Residue:
159
  
Inhibitor
Name:
BDBM18253
Synonyms:
6-[(2,4-dichlorophenyl)sulfanyl]-5-ethyl-7H-pyrrolo[2,3-d]pyrimidine-2,4-diamine | Pyrrolo[2, 3-d]pyrimidine analogue, 10
Type:
Small organic molecule
Emp. Form.:
C14H13Cl2N5S
Mol. Mass.:
354.258
SMILES:
CCc1c(Sc2ccc(Cl)cc2Cl)[nH]c2nc(N)nc(N)c12
:
Substrate
Name:
BDBM18044
Synonyms:
(2S)-2-[(4-{[(2-amino-4-oxo-1,4,7,8-tetrahydropteridin-6-yl)methyl]amino}phenyl)formamido]pentanedioic acid dihydrofolic acid
Type:
Small organic molecule
Emp. Form.:
C19H21N7O6
Mol. Mass.:
443.4133
SMILES:
Nc1nc2NCC(CNc3ccc(cc3)C(=O)N[C@@H](CCC(O)=O)C(O)=O)=Nc2c(=O)[nH]1
: