Target
Renin
Ligand
BDBM18281
Substrate
tetradecapeptide substrate, TDP
Meas. Tech.
In Vitro Enzyme Inhibition
pH
7.2±n/a
Temperature
310.15±n/a K
IC50
120±n/a nM
Citation
 Göschke, RStutz, SRasetti, VCohen, NCRahuel, JRigollier, PBaum, HPForgiarini, PSchnell, CRWagner, TGruetter, MGFuhrer, WSchilling, WCumin, FWood, JMMaibaum, J Novel 2,7-Dialkyl-Substituted 5(S)-Amino-4(S)-hydroxy-8-phenyl-octanecarboxamide Transition State Peptidomimetics Are Potent and Orally Active Inhibitors of Human Renin. J Med Chem 50:4818-31 (2007)  
Target
Name:
Renin
Synonyms:
Angiotensinogenase RENI_HUMAN
Type:
Enzyme
Mol. Mass.:
45058.99
Organism:
Homo sapiens (Human)
Description:
Residue:
406
  
Inhibitor
Name:
BDBM18281
Synonyms:
(2S,4S,5S,7S)-5-amino-N-butyl-4-hydroxy-7-{[4-methoxy-3-(3-methoxypropoxy)phenyl]methyl}-2,8-dimethylnonanamide | 8-phenyl-octanecarboxamide peptidomimetic, 38b
Type:
Small organic molecule
Emp. Form.:
C27H48N2O5
Mol. Mass.:
480.6804
SMILES:
CCCCNC(=O)[C@@H](C)C[C@H](O)[C@@H](N)C[C@H](Cc1ccc(OC)c(OCCCOC)c1)C(C)C
:
Substrate
Name:
tetradecapeptide substrate, TDP
Synonyms:
Type:
Peptide
Mol. Mass.:
4775.39
Organism:
Description:
Residue:
42