Target
Androgen receptor
Ligand
BDBM18689
Substrate
BDBM26258
Meas. Tech.
Competitive Radioligand Displacement Assay
pH
7.4±n/a
Temperature
277.15±n/a K
Ki
10.7±0.6 nM
Citation
 Kirkovsky, LMukherjee, AYin, DDalton, JTMiller, DD Chiral nonsteroidal affinity ligands for the androgen receptor. 1. Bicalutamide analogues bearing electrophilic groups in the B aromatic ring. J Med Chem 43:581-90 (2000)  
Target
Name:
Androgen receptor
Synonyms:
ANDR_RAT Ar Nr3c4 | androgen
Type:
Enzyme
Mol. Mass.:
98219.08
Organism:
Rattus norvegicus (Rat)
Description:
P15207
Residue:
902
  
Inhibitor
Name:
BDBM18689
Synonyms:
(2R)-3-{[4-(2-chloroacetamido)benzene]sulfonyl}-N-[4-cyano-3-(trifluoromethyl)phenyl]-2-hydroxy-2-methylpropanamide | Bicalutamide Analogue, (R)-15
Type:
Small organic molecule
Emp. Form.:
C20H17ClF3N3O5S
Mol. Mass.:
503.879
SMILES:
C[C@](O)(CS(=O)(=O)c1ccc(NC(=O)CCl)cc1)C(=O)Nc1ccc(C#N)c(c1)C(F)(F)F
:
Substrate
Name:
BDBM26258
Synonyms:
(1S,2R,9R,10R,11S,14S,15S)-14-hydroxy-9,14,15-trimethyltetracyclo[8.7.0.0^{2,7}.0^{11,15}]heptadec-6-en-5-one [3H]Mibolerone
Type:
radiolabeled ligand
Emp. Form.:
C20H30O2
Mol. Mass.:
302.451
SMILES:
[H][C@@]12CC[C@](C)(O)[C@@]1(C)CC[C@]1([H])[C@@]3([H])CCC(=O)C=C3C[C@@H](C)[C@@]21[H]
: