Target
Thymidylate synthase
Ligand
BDBM18759
Substrate
BDBM18754
Meas. Tech.
Thymidylate Synthase (TS) Assay
pH
7.4±n/a
Temperature
293.15±n/a K
Ki
1700±n/a nM
Comments
Compound showed null or very low toxicity in the cytotoxicity test against gram-positive and gram-negative wild-type bacterial strains.It showed good activity against most of the multi-resistant strains tested, in particular against Staphylococcus epidermidis.It showed an MIC value of approximately 0.5 ug/mL.
Citation
 Costi, MPGelain, ABarlocco, DGhelli, SSoragni, FReniero, FRossi, TRuberto, AGuillou, CCavazzuti, ACasolari, CFerrari, S Antibacterial agent discovery using thymidylate synthase biolibrary screening. J Med Chem 49:5958-68 (2006)  
Target
Name:
Thymidylate synthase
Synonyms:
TSase Thymidylate Synthase (TS) thyA
Type:
Enzyme
Mol. Mass.:
36576.54
Organism:
Lactobacillus casei
Description:
Residue:
316
  
Inhibitor
Name:
BDBM18759
Synonyms:
1,2-naphthalein derivative, 5 Phenolnaphthalein derivative, 5
Type:
Small organic molecule
Emp. Form.:
C24H12Br4O4
Mol. Mass.:
683.966
SMILES:
Oc1c(Br)cc(cc1Br)C1(OC(=O)c2ccc3ccccc3c12)c1cc(Br)c(O)c(Br)c1
:
Substrate
Name:
BDBM18754
Synonyms:
(2S)-2-[(4-{11-amino-13-oxo-2,4,8,10,12-pentaazatricyclo[7.4.0.0^{2,6}]trideca-1(9),11-dien-4-yl}phenyl)formamido]pentanedioate 5,10-Methylenetetrahydrofolate
Type:
Small organic molecule
Emp. Form.:
C20H21N7O6
Mol. Mass.:
455.4251
SMILES:
Nc1nc2NCC3CN(CN3c2c(=O)[nH]1)c1ccc(cc1)C(=O)N[C@@H](CCC([O-])=O)C([O-])=O
: