Target
Thymidylate synthase
Ligand
BDBM18763
Substrate
BDBM18754
Meas. Tech.
Thymidylate Synthase (TS) Assay
pH
7.4±n/a
Temperature
293.15±n/a K
Ki
600±n/a nM
Comments
Compound showed null or very low toxicity in the cytotoxicity test against gram-positive and gram-negative wild-type bacterial strains.
Citation
 Costi, MPGelain, ABarlocco, DGhelli, SSoragni, FReniero, FRossi, TRuberto, AGuillou, CCavazzuti, ACasolari, CFerrari, S Antibacterial agent discovery using thymidylate synthase biolibrary screening. J Med Chem 49:5958-68 (2006)  
Target
Name:
Thymidylate synthase
Synonyms:
TS TYSY_ECOLI thyA
Type:
Enzyme
Mol. Mass.:
30475.81
Organism:
Escherichia coli
Description:
Residue:
264
  
Inhibitor
Name:
BDBM18763
Synonyms:
1,8-naphthalein derivative, 10 A15 Alpha 156 | CHEMBL67116
Type:
Small organic molecule
Emp. Form.:
C24H14Cl2O4
Mol. Mass.:
437.272
SMILES:
Oc1ccc(cc1Cl)C1(OC(=O)c2cccc3cccc1c23)c1ccc(O)c(Cl)c1
:
Substrate
Name:
BDBM18754
Synonyms:
(2S)-2-[(4-{11-amino-13-oxo-2,4,8,10,12-pentaazatricyclo[7.4.0.0^{2,6}]trideca-1(9),11-dien-4-yl}phenyl)formamido]pentanedioate 5,10-Methylenetetrahydrofolate
Type:
Small organic molecule
Emp. Form.:
C20H21N7O6
Mol. Mass.:
455.4251
SMILES:
Nc1nc2NCC3CN(CN3c2c(=O)[nH]1)c1ccc(cc1)C(=O)N[C@@H](CCC([O-])=O)C([O-])=O
: