Target
Vascular endothelial growth factor receptor 2
Ligand
BDBM139576
Substrate
Meas. Tech.
Kinase Assay
Ki
>10000±n/a nM
Citation
 Hull, III, CEMalone, TC Method of treating conditions with kinase inhibitors US Patent  US9820989 Publication Date 11/21/2017 
Target
Name:
Vascular endothelial growth factor receptor 2
Synonyms:
CD_antigen=CD309 Fetal liver kinase 1 (FLK-1) KDR Protein-tyrosine kinase receptor Flk-1 VEGFR-2 VEGFR2 Vascular Endothelial Growth Factor Receptor Kinase 2 Vascular endothelial growth factor receptor 2 (KDR) Vascular endothelial growth factor receptor 2 (VEGFR2) Vascular endothelial growth factor receptor-2 (VEGFR-2)
Type:
Receptor Tyrosine Kinase
Mol. Mass.:
151510.97
Organism:
Homo sapiens (Human)
Description:
P35968
Residue:
1356
  
Inhibitor
Name:
BDBM139576
Synonyms:
US8889870, 55 US9820989, 55
Type:
Small organic molecule
Emp. Form.:
C20H17F3N6O
Mol. Mass.:
414.3838
SMILES:
Nc1ncc2CN(CCc2n1)c1cc(ccn1)C(=O)Nc1cccc(c1)C(F)(F)F
: