Target
Platelet-derived growth factor receptor beta
Ligand
BDBM139602
Substrate
Meas. Tech.
Kinase Assay
Ki
273±n/a nM
Citation
 Hull, III, CEMalone, TC Method of treating conditions with kinase inhibitors US Patent  US9820989 Publication Date 11/21/2017 
Target
Name:
Platelet-derived growth factor receptor beta
Synonyms:
Beta-type platelet-derived growth factor receptor CD140b antigen PDGF Receptor Substrate PDGFR PDGFR-1 PDGFRB PGFRB_HUMAN Platelet-derived growth factor receptor 1 Platelet-derived growth factor receptor beta (PDGFR-beta) Platelet-derived growth factor receptor beta (PDGFRbeta) | VHL/PDGFRB
Type:
Enzyme
Mol. Mass.:
123922.25
Organism:
Homo sapiens (Human)
Description:
P09619
Residue:
1106
  
Inhibitor
Name:
BDBM139602
Synonyms:
US8889870, 148 US9820989, 148
Type:
Small organic molecule
Emp. Form.:
C22H20F3N5O
Mol. Mass.:
427.4223
SMILES:
Cc1cc(cc(c1)C(=O)Nc1cccc(c1)C(F)(F)F)N1CCc2nc(N)ncc2C1
: