Target
Thyroid hormone receptor beta
Ligand
BDBM18864
Substrate
BDBM18860
Meas. Tech.
TRbeta-Binding Assay
pH
7±n/a
Temperature
277.15±n/a K
IC50
0.019±n/a nM
Citation
 Ye, LLi, YLMellström, KMellin, CBladh, LGKoehler, KGarg, NGarcia Collazo, AMLitten, CHusman, BPersson, KLjunggren, JGrover, GSleph, PGGeorge, RMalm, J Thyroid receptor ligands. 1. Agonist ligands selective for the thyroid receptor beta1. J Med Chem 46:1580-8 (2003)  
Target
Name:
Thyroid hormone receptor beta
Synonyms:
ERBA2 Nuclear receptor subfamily 1 group A member 2 THR1 c-erbA-2 | c-erbA-beta
Type:
Receptor
Mol. Mass.:
52793.62
Organism:
Homo sapiens (Human)
Description:
Recombinant hThR was obtained from nuclear extracts from SF9 cells infected with baculovirus vectors encoding for ThRbeta 1.
Residue:
461
  
Inhibitor
Name:
BDBM18864
Synonyms:
3-[4-(4-hydroxy-3-iodophenoxy)-3,5-diiodophenyl]propanoic acid cid_5804 | triiodothyropropionic acid, 5
Type:
Small organic molecule
Emp. Form.:
C15H11I3O4
Mol. Mass.:
635.9589
SMILES:
OC(=O)CCc1cc(I)c(Oc2ccc(O)c(I)c2)c(I)c1
:
Substrate
Name:
BDBM18860
Synonyms:
(2R)-2-amino-3-[4-(4-hydroxy-3-iodophenoxy)-3,5-diiodophenyl]propanoic acid 3,5,3'-triiodo-L-thyronine (T3) Triiodothyronine US10544075, Compound T3 liothyronine | triothyrone
Type:
Hormone
Emp. Form.:
C15H12I3NO4
Mol. Mass.:
650.9735
SMILES:
N[C@@H](Cc1cc(I)c(Oc2ccc(O)c(I)c2)c(I)c1)C(O)=O
: