Target
Thyroid hormone receptor beta
Ligand
BDBM18870
Substrate
BDBM18860
Meas. Tech.
TRbeta-Binding Assay and Thyroid Response Element (TRAFbeta1) Reporter Assay.
pH
7±n/a
Temperature
277.15±n/a K
IC50
0.15±0.025 nM
EC50
0.28±n/a nM
Citation
 Ye, LLi, YLMellström, KMellin, CBladh, LGKoehler, KGarg, NGarcia Collazo, AMLitten, CHusman, BPersson, KLjunggren, JGrover, GSleph, PGGeorge, RMalm, J Thyroid receptor ligands. 1. Agonist ligands selective for the thyroid receptor beta1. J Med Chem 46:1580-8 (2003)  
Target
Name:
Thyroid hormone receptor beta
Synonyms:
ERBA2 Nuclear receptor subfamily 1 group A member 2 THR1 c-erbA-2 | c-erbA-beta
Type:
Receptor
Mol. Mass.:
52793.62
Organism:
Homo sapiens (Human)
Description:
Recombinant hThR was obtained from nuclear extracts from SF9 cells infected with baculovirus vectors encoding for ThRbeta 1.
Residue:
461
  
Inhibitor
Name:
BDBM18870
Synonyms:
3-{3,5-dichloro-4-[4-hydroxy-3-(propan-2-yl)phenoxy]phenyl}propanoic acid | dichloro phenylpropionic acid, 17
Type:
Small organic molecule
Emp. Form.:
C18H18Cl2O4
Mol. Mass.:
369.239
SMILES:
CC(C)c1cc(Oc2c(Cl)cc(CCC(O)=O)cc2Cl)ccc1O
:
Substrate
Name:
BDBM18860
Synonyms:
(2R)-2-amino-3-[4-(4-hydroxy-3-iodophenoxy)-3,5-diiodophenyl]propanoic acid 3,5,3'-triiodo-L-thyronine (T3) Triiodothyronine US10544075, Compound T3 liothyronine | triothyrone
Type:
Hormone
Emp. Form.:
C15H12I3NO4
Mol. Mass.:
650.9735
SMILES:
N[C@@H](Cc1cc(I)c(Oc2ccc(O)c(I)c2)c(I)c1)C(O)=O
: