Target
Thyroid hormone receptor beta
Ligand
BDBM18904
Substrate
BDBM18860
Meas. Tech.
TRbeta-Binding Assay and Thyroid Response Element (TRAFbeta1) Reporter Assay.
pH
7±n/a
Temperature
277.15±n/a K
IC50
770±n/a nM
EC50
0.52±n/a nM
Citation
 Hedfors, AAppelqvist, TCarlsson, BBladh, LGLitten, CAgback, PGrynfarb, MKoehler, KFMalm, J Thyroid receptor ligands. 3. Design and synthesis of 3,5-dihalo-4-alkoxyphenylalkanoic acids as indirect antagonists of the thyroid hormone receptor. J Med Chem 48:3114-7 (2005)  
Target
Name:
Thyroid hormone receptor beta
Synonyms:
ERBA2 Nuclear receptor subfamily 1 group A member 2 THR1 c-erbA-2 | c-erbA-beta
Type:
Receptor
Mol. Mass.:
52793.62
Organism:
Homo sapiens (Human)
Description:
Recombinant hThR was obtained from nuclear extracts from SF9 cells infected with baculovirus vectors encoding for ThRbeta 1.
Residue:
461
  
Inhibitor
Name:
BDBM18904
Synonyms:
2-[3,5-dibromo-4-(cyclohexylmethoxy)phenyl]acetic acid | 3,5-Dibromo-4-alkoxyphenylalkanoic Acid, 9g
Type:
Small organic molecule
Emp. Form.:
C15H18Br2O3
Mol. Mass.:
406.11
SMILES:
OC(=O)Cc1cc(Br)c(OCC2CCCCC2)c(Br)c1
:
Substrate
Name:
BDBM18860
Synonyms:
(2R)-2-amino-3-[4-(4-hydroxy-3-iodophenoxy)-3,5-diiodophenyl]propanoic acid 3,5,3'-triiodo-L-thyronine (T3) Triiodothyronine US10544075, Compound T3 liothyronine | triothyrone
Type:
Hormone
Emp. Form.:
C15H12I3NO4
Mol. Mass.:
650.9735
SMILES:
N[C@@H](Cc1cc(I)c(Oc2ccc(O)c(I)c2)c(I)c1)C(O)=O
: