Target
Thyroid hormone receptor beta
Ligand
BDBM18906
Substrate
BDBM18860
Meas. Tech.
TRbeta-Binding Assay and Thyroid Response Element (TRAFbeta1) Reporter Assay.
pH
7±n/a
Temperature
277.15±n/a K
IC50
360±n/a nM
EC50
1.0±n/a nM
Citation
 Hedfors, AAppelqvist, TCarlsson, BBladh, LGLitten, CAgback, PGrynfarb, MKoehler, KFMalm, J Thyroid receptor ligands. 3. Design and synthesis of 3,5-dihalo-4-alkoxyphenylalkanoic acids as indirect antagonists of the thyroid hormone receptor. J Med Chem 48:3114-7 (2005)  
Target
Name:
Thyroid hormone receptor beta
Synonyms:
ERBA2 Nuclear receptor subfamily 1 group A member 2 THR1 c-erbA-2 | c-erbA-beta
Type:
Receptor
Mol. Mass.:
52793.62
Organism:
Homo sapiens (Human)
Description:
Recombinant hThR was obtained from nuclear extracts from SF9 cells infected with baculovirus vectors encoding for ThRbeta 1.
Residue:
461
  
Inhibitor
Name:
BDBM18906
Synonyms:
3,5-Dibromo-4-alkoxyphenylalkanoic Acid, 9i | 3-[3,5-dibromo-4-(hexyloxy)phenyl]propanoic acid
Type:
Small organic molecule
Emp. Form.:
C15H20Br2O3
Mol. Mass.:
408.126
SMILES:
CCCCCCOc1c(Br)cc(CCC(O)=O)cc1Br
:
Substrate
Name:
BDBM18860
Synonyms:
(2R)-2-amino-3-[4-(4-hydroxy-3-iodophenoxy)-3,5-diiodophenyl]propanoic acid 3,5,3'-triiodo-L-thyronine (T3) Triiodothyronine US10544075, Compound T3 liothyronine | triothyrone
Type:
Hormone
Emp. Form.:
C15H12I3NO4
Mol. Mass.:
650.9735
SMILES:
N[C@@H](Cc1cc(I)c(Oc2ccc(O)c(I)c2)c(I)c1)C(O)=O
: