Target
Thyroid hormone receptor beta
Ligand
BDBM18947
Substrate
BDBM18860
Meas. Tech.
TRalpha-Binding Assay.
IC50
4.2±n/a nM
Citation
 Hangeland, JJDoweyko, AMDejneka, TFriends, TJDevasthale, PMellström, KSandberg, JGrynfarb, MSack, JSEinspahr, HFärnegård, MHusman, BLjunggren, JKoehler, KSheppard, CMalm, JRyono, DE Thyroid receptor ligands. Part 2: Thyromimetics with improved selectivity for the thyroid hormone receptor beta. Bioorg Med Chem Lett 14:3549-53 (2004)  
Target
Name:
Thyroid hormone receptor beta
Synonyms:
ERBA2 Nuclear receptor subfamily 1 group A member 2 THR1 c-erbA-2 | c-erbA-beta
Type:
Receptor
Mol. Mass.:
52793.62
Organism:
Homo sapiens (Human)
Description:
Recombinant hThR was obtained from nuclear extracts from SF9 cells infected with baculovirus vectors encoding for ThRbeta 1.
Residue:
461
  
Inhibitor
Name:
BDBM18947
Synonyms:
2-{4-[3-(benzylcarbamoyl)-4-hydroxyphenoxy]-3,5-dibromophenyl}acetic acid | 4-hydroxy thyromimetic, 15b
Type:
Small organic molecule
Emp. Form.:
C22H17Br2NO5
Mol. Mass.:
535.182
SMILES:
OC(=O)Cc1cc(Br)c(Oc2ccc(O)c(c2)C(=O)NCc2ccccc2)c(Br)c1
:
Substrate
Name:
BDBM18860
Synonyms:
(2R)-2-amino-3-[4-(4-hydroxy-3-iodophenoxy)-3,5-diiodophenyl]propanoic acid 3,5,3'-triiodo-L-thyronine (T3) Triiodothyronine US10544075, Compound T3 liothyronine | triothyrone
Type:
Hormone
Emp. Form.:
C15H12I3NO4
Mol. Mass.:
650.9735
SMILES:
N[C@@H](Cc1cc(I)c(Oc2ccc(O)c(I)c2)c(I)c1)C(O)=O
: