Target
Integrin alpha-2/beta-1 [T112H]
Ligand
BDBM19053
Substrate
Collagen I
Meas. Tech.
Human Platelet Adhesion Assay
IC50
138±n/a nM
Citation
 Choi, SVilaire, GMarcinkiewicz, CWinkler, JDBennett, JSDeGrado, WF Small molecule inhibitors of integrin alpha2beta1. J Med Chem 50:5457-62 (2007)  
Target
Name:
Integrin alpha-2/beta-1 [T112H]
Synonyms:
Integrin alpha2beta1
Type:
Protein Complex
Mol. Mass.:
Description:
From human platelet.
Components:
This complex has 2 components.
Component 1
Name:
Integrin alpha-2
Synonyms:
CD49B Collagen receptor ITA2_HUMAN Integrin alpha-2 precursor Platelet membrane glycoprotein Ia | VLA-2 alpha chain
Type:
Single-pass type I membrane protein
Mol. Mass.:
129273.27
Organism:
Homo sapiens (Human)
Description:
Residue:
1181
  
Component 2
Name:
Integrin beta-1 [T112H]
Synonyms:
CD29 antigen Fibronectin receptor subunit beta ITGB1 Integrin beta1 MSK12
Type:
Membrane Protein
Mol. Mass.:
88450.95
Organism:
Homo sapiens (Human)
Description:
P05556[T112H]
Residue:
798
  
Inhibitor
Name:
BDBM19053
Synonyms:
(2S)-2-{[(2R)-1-(benzenesulfonyl)pyrrolidin-2-yl]formamido}-3-[(benzylcarbamoyl)amino]propanoic acid | prolyl-2,3-diaminopropionic acid (DAP) scaffold, 9
Type:
Small organic molecule
Emp. Form.:
C22H26N4O6S
Mol. Mass.:
474.53
SMILES:
OC(=O)[C@H](CNC(=O)NCc1ccccc1)NC(=O)C1CCCN1S(=O)(=O)c1ccccc1
:
Substrate
Name:
Collagen I
Synonyms:
Alpha-1 type I collagen | Collagen alpha-1(I) chain
Type:
Other Protein Type
Mol. Mass.:
94774.46
Organism:
Homo sapiens (Human)
Description:
Residue:
1057