Target
E3 ubiquitin-protein ligase XIAP [124-240]
Ligand
BDBM243099
Substrate
Meas. Tech.
TR-FRET Assay for BIR2 and BIR3
pH
7.5±n/a
Temperature
298.15±n/a K
IC50
1.000±n/a nM
Comments
extracted
Citation
 Chen, SDonnell, AFKester, RFLe, KLou, YMichoud, CRemiszewski, SRupert, KCWeisel, M Tetrahydro-benzodiazepinones US Patent  US10053431 Publication Date 8/21/2018 
Target
Name:
E3 ubiquitin-protein ligase XIAP [124-240]
Synonyms:
6x Histidine-tagged BIR2 domain BIR2 (aa 124-240) E3 ubiquitin-protein ligase (XIAP-BIR2)(C202A/C213G) XIAP XIAP_HUMAN | amino acids 124-240 of XIAP
Type:
Enzyme Catalytic Domain
Mol. Mass.:
13562.46
Organism:
Homo sapiens (Human)
Description:
P98170[124-240]
Residue:
117
  
Inhibitor
Name:
BDBM243099
Synonyms:
(S)—N—((S)-5-(4-Acetylbenzoyl)-1-((6-bromo-2-methoxynaphthalen-1-yl)methyl)-2-oxo-2,3,4,5-tetrahydro-1H-benzo[b][1,4]diazepin-3-yl)-2-(methylamino)butanamide hydrochloride | US10053431, 79
Type:
Small organic molecule
Emp. Form.:
C35H35BrN4O5
Mol. Mass.:
671.58
SMILES:
CCC(NC)C(=O)N[C@H]1CN(C(=O)c2ccc(cc2)C(C)=O)c2ccccc2N(Cc2c(OC)ccc3cc(Br)ccc23)C1=O
: