Target
Inosine-5'-monophosphate dehydrogenase 2
Ligand
BDBM19257
Substrate
BDBM19254
Meas. Tech.
IMPDH Type 2 Enzyme Assay
pH
8±n/a
Temperature
298.15±n/a K
Ki
27±3 nM
Citation
 Chen, LGao, GFelczak, KBonnac, LPatterson, SEWilson, DBennett, EMJayaram, HNHedstrom, LPankiewicz, KW Probing Binding Requirements of Type I and Type II Isoforms of Inosine Monophosphate Dehydrogenase with Adenine-Modified Nicotinamide Adenine Dinucleotide Analogues. J Med Chem 50:5743-5751 (2007)  
Target
Name:
Inosine-5'-monophosphate dehydrogenase 2
Synonyms:
IMDH2_HUMAN IMPD 2 IMPDH-II Inosine 5'-monophosphate dehydrogenase II (IMPDH II) Inosine-5 -monophosphate dehydrogenase 2 | Inosine-5'-monophosphate dehydrogenase (IMPDH)
Type:
Enzyme
Mol. Mass.:
55806.87
Organism:
Homo sapiens (Human)
Description:
Recombinant IMPDH2 expressed in E. coli.
Residue:
514
  
Inhibitor
Name:
BDBM19257
Synonyms:
Tiazofurin Adenine Dinucleotide (TAD) Analogue, 27 | {[(2R,3S,4R,5R)-5-(4-carbamoyl-1,3-thiazol-2-yl)-3,4-dihydroxyoxolan-2-yl]methoxy}[({[(2R,3S,4R,5R)-5-(2,6-diamino-9H-purin-9-yl)-3,4-dihydroxyoxolan-2-yl]methoxy}(hydroxy)phosphoryl)oxy]phosphinic acid
Type:
Small organic molecule
Emp. Form.:
C19H26N8O14P2S
Mol. Mass.:
684.467
SMILES:
NC(=O)c1csc(n1)[C@@H]1O[C@H](COP(O)(=O)OP(O)(=O)OC[C@H]2O[C@H]([C@H](O)[C@@H]2O)n2cnc3c(N)nc(N)nc23)[C@@H](O)[C@H]1O
:
Substrate
Name:
BDBM19254
Synonyms:
IMP Inosinic acid [(2R,3S,4R,5R)-3,4-dihydroxy-5-(6-oxo-3H-purin-9-yl)oxolan-2-yl]methyl dihydrogen {[(2R,3S,4R,5R)-3,4-dihydroxy-5-(6-oxo-6,9-dihydro-3H-purin-9-yl)oxolan-2-yl]methoxy}phosphonic acid
Type:
Nucleoside or nucleotide
Emp. Form.:
C10H13N4O8P
Mol. Mass.:
348.206
SMILES:
O[C@@H]1[C@@H](COP(O)(O)=O)O[C@H]([C@@H]1O)n1cnc2c1nc[nH]c2=O
: