Target
Transient receptor potential cation channel subfamily A member 1
Ligand
BDBM361736
Substrate
Meas. Tech.
Measuring Inhibition of the TRPA1 Ion Channel
IC50
1.000±n/a nM
Citation
 Chenard, BLWu, X Inhibiting the transient receptor potential A1 ion channel US Patent  US10221177 Publication Date 3/5/2019 
Target
Name:
Transient receptor potential cation channel subfamily A member 1
Synonyms:
ANKTM1 TRPA1 Transformation-sensitive protein p120 | Transient receptor potential cation channel subfamily A member 1 (TRPA1)
Type:
Protein
Mol. Mass.:
127514.20
Organism:
Homo sapiens (Human)
Description:
O75762
Residue:
1119
  
Inhibitor
Name:
BDBM361736
Synonyms:
US10221177, Compound 99
Type:
Small organic molecule
Emp. Form.:
C23H22F3N7O4S
Mol. Mass.:
549.525
SMILES:
CCC(=O)Cn1c(=O)n(C)c2ncn([C@@H](C)C(=O)Nc3csc(n3)-c3cnc(C)c(c3)C(F)(F)F)c2c1=O
: