Target
Amine oxidase [flavin-containing] A
Ligand
BDBM256638
Substrate
Meas. Tech.
MAO-A Inhibitory Activity
pH
7.5±n/a
Temperature
298.15±n/a K
IC50
>100000±n/a nM
Comments
extracted
Citation
 Matsumoto, SHattori, YToyofuku, MMorimoto, SDaini, MKojima, TKaku, TIto, M Cyclopropanamine compound and use thereof US Patent  US10053456 Publication Date 8/21/2018 
Target
Name:
Amine oxidase [flavin-containing] A
Synonyms:
AOFA_HUMAN MAO-A Monoamine oxidase Monoamine oxidase type A (MAO A) Monoamine oxidase type A (MAOA)
Type:
Protein
Mol. Mass.:
59689.53
Organism:
Homo sapiens (Human)
Description:
P21397
Residue:
527
  
Inhibitor
Name:
BDBM256638
Synonyms:
US10053456, 17 US10968213, Example 17 US9718814, 17 | US9920047, 17
Type:
Small organic molecule
Emp. Form.:
C16H20N4OS2
Mol. Mass.:
348.486
SMILES:
Cc1nnc(NC(=O)c2cc(C3CC3NC3CCC3)c(C)s2)s1
: