Target
Cathepsin B
Ligand
BDBM19800
Substrate
BDBM19485
Meas. Tech.
In Vitro Enzyme Inhibition Assay
pH
5.5±n/a
Temperature
295.15±n/a K
Ki
>10000±n/a nM
Citation
 Marquis, RWRu, YZeng, JTrout, RELoCastro, SMGribble, ADWitherington, JFenwick, AEGarnier, BTomaszek, TTew, DHemling, MEQuinn, CJSmith, WWZhao, BMcQueney, MSJanson, CAD'Alessio, KVeber, DF Cyclic ketone inhibitors of the cysteine protease cathepsin K. J Med Chem 44:725-36 (2001)  
Target
Name:
Cathepsin B
Synonyms:
APP secretase CATB_HUMAN CTSB Cathepsin B light chain | Cathepsin B1
Type:
Enzyme
Mol. Mass.:
37819.69
Organism:
Homo sapiens (Human)
Description:
gi_63102437
Residue:
339
  
Inhibitor
Name:
BDBM19800
Synonyms:
benzyl N-[(1S)-3-methyl-1-[(2-oxocyclopentyl)carbamoyl]butyl]carbamate | carbocyclic analogue, 7
Type:
Small organic molecule
Emp. Form.:
C19H26N2O4
Mol. Mass.:
346.4207
SMILES:
CC(C)C[C@H](NC(=O)OCc1ccccc1)C(=O)NC1CCCC1=O
:
Substrate
Name:
BDBM19485
Synonyms:
Cbz-Phe-Arg-AMC Z-Phe-Arg-AMC.HCl
Type:
Emp. Form.:
Mol. Mass.:
SMILES:
: