Target
Cathepsin K
Ligand
BDBM19884
Substrate
BDBM19480
Meas. Tech.
Enzyme Inhibition Assay
pH
5.5±n/a
Temperature
295.15±n/a K
IC50
8±n/a nM
Citation
 Robichaud, JOballa, RPrasit, PFalgueyret, JPPercival, MDWesolowski, GRodan, SBKimmel, DJohnson, CBryant, CVenkatraman, SSetti, EMendonca, RPalmer, JT A novel class of nonpeptidic biaryl inhibitors of human cathepsin K. J Med Chem 46:3709-27 (2003)  
Target
Name:
Cathepsin K
Synonyms:
CATK_HUMAN CTSO Cathepsin O Cathepsin X
Type:
Enzyme
Mol. Mass.:
36975.68
Organism:
Homo sapiens (Human)
Description:
P43235
Residue:
329
  
Inhibitor
Name:
BDBM19884
Synonyms:
N-(cyanomethyl)-4-methyl-2-{3-[4-(4-methylpiperazin-1-yl)phenyl]phenyl}pentanamide | Nonpeptidic Biaryl Nitrile Compound, (RS)-46
Type:
Small organic molecule
Emp. Form.:
C25H32N4O
Mol. Mass.:
404.5478
SMILES:
CC(C)CC(C(=O)NCC#N)c1cccc(c1)-c1ccc(cc1)N1CCN(C)CC1
:
Substrate
Name:
BDBM19480
Synonyms:
Cbz-Leu-Arg-AMC Z-Leu-Arg-AMC
Type:
Emp. Form.:
Mol. Mass.:
SMILES:
: