Target
Cathepsin K
Ligand
BDBM19894
Substrate
BDBM19480
Meas. Tech.
Enzyme Inhibition Assay
IC50
16±n/a nM
Citation
 Robichaud, JOballa, RPrasit, PFalgueyret, JPPercival, MDWesolowski, GRodan, SBKimmel, DJohnson, CBryant, CVenkatraman, SSetti, EMendonca, RPalmer, JT A novel class of nonpeptidic biaryl inhibitors of human cathepsin K. J Med Chem 46:3709-27 (2003)  
Target
Name:
Cathepsin K
Synonyms:
CATK_HUMAN CTSO Cathepsin O Cathepsin X
Type:
Enzyme
Mol. Mass.:
36975.68
Organism:
Homo sapiens (Human)
Description:
P43235
Residue:
329
  
Inhibitor
Name:
BDBM19894
Synonyms:
(2R)-2-(3-{4-[4-(2-amino-2-methylpropyl)piperazin-1-yl]phenyl}phenyl)-N-(cyanomethyl)-4-methylpentanamide | Nonpeptidic Biaryl Nitrile Compound, 14
Type:
Small organic molecule
Emp. Form.:
C28H39N5O
Mol. Mass.:
461.6422
SMILES:
CC(C)C[C@@H](C(=O)NCC#N)c1cccc(c1)-c1ccc(cc1)N1CCN(CC(C)(C)N)CC1
:
Substrate
Name:
BDBM19480
Synonyms:
Cbz-Leu-Arg-AMC Z-Leu-Arg-AMC
Type:
Emp. Form.:
Mol. Mass.:
SMILES:
: