Target
Cathepsin K
Ligand
BDBM19896
Substrate
BDBM19480
Meas. Tech.
Enzyme Inhibition Assay
IC50
1405±n/a nM
Citation
 Robichaud, JOballa, RPrasit, PFalgueyret, JPPercival, MDWesolowski, GRodan, SBKimmel, DJohnson, CBryant, CVenkatraman, SSetti, EMendonca, RPalmer, JT A novel class of nonpeptidic biaryl inhibitors of human cathepsin K. J Med Chem 46:3709-27 (2003)  
Target
Name:
Cathepsin K
Synonyms:
CATK_HUMAN CTSO Cathepsin O Cathepsin X
Type:
Enzyme
Mol. Mass.:
36975.68
Organism:
Homo sapiens (Human)
Description:
P43235
Residue:
329
  
Inhibitor
Name:
BDBM19896
Synonyms:
N-(cyanomethyl)-2-{3-[4-(4-methylpiperazin-1-yl)phenyl]phenyl}-3-phenylpropanamide | Nonpeptidic Biaryl Nitrile Compound, 28b
Type:
Small organic molecule
Emp. Form.:
C28H30N4O
Mol. Mass.:
438.564
SMILES:
CN1CCN(CC1)c1ccc(cc1)-c1cccc(c1)C(Cc1ccccc1)C(=O)NCC#N
:
Substrate
Name:
BDBM19480
Synonyms:
Cbz-Leu-Arg-AMC Z-Leu-Arg-AMC
Type:
Emp. Form.:
Mol. Mass.:
SMILES:
: