Target
Cathepsin K
Ligand
BDBM19897
Substrate
BDBM19480
Meas. Tech.
Enzyme Inhibition Assay
IC50
87±n/a nM
Citation
 Robichaud, JOballa, RPrasit, PFalgueyret, JPPercival, MDWesolowski, GRodan, SBKimmel, DJohnson, CBryant, CVenkatraman, SSetti, EMendonca, RPalmer, JT A novel class of nonpeptidic biaryl inhibitors of human cathepsin K. J Med Chem 46:3709-27 (2003)  
Target
Name:
Cathepsin K
Synonyms:
CATK_HUMAN CTSO Cathepsin O Cathepsin X
Type:
Enzyme
Mol. Mass.:
36975.68
Organism:
Homo sapiens (Human)
Description:
P43235
Residue:
329
  
Inhibitor
Name:
BDBM19897
Synonyms:
N-(cyanomethyl)-2-{3-[4-(4-methylpiperazin-1-yl)phenyl]phenyl}pentanamide | Nonpeptidic Biaryl Nitrile Compound, 28c
Type:
Small organic molecule
Emp. Form.:
C24H30N4O
Mol. Mass.:
390.5212
SMILES:
CCCC(C(=O)NCC#N)c1cccc(c1)-c1ccc(cc1)N1CCN(C)CC1
:
Substrate
Name:
BDBM19480
Synonyms:
Cbz-Leu-Arg-AMC Z-Leu-Arg-AMC
Type:
Emp. Form.:
Mol. Mass.:
SMILES:
: