Target
Cathepsin S
Ligand
BDBM19881
Substrate
BDBM19490
Meas. Tech.
Enzyme Inhibition Assay
IC50
>10000±n/a nM
Citation
 Robichaud, JOballa, RPrasit, PFalgueyret, JPPercival, MDWesolowski, GRodan, SBKimmel, DJohnson, CBryant, CVenkatraman, SSetti, EMendonca, RPalmer, JT A novel class of nonpeptidic biaryl inhibitors of human cathepsin K. J Med Chem 46:3709-27 (2003)  
Target
Name:
Cathepsin S
Synonyms:
CATS_HUMAN Cathepsin S (Cat S) | cathepsin S preproprotein
Type:
Protein
Mol. Mass.:
37507.38
Organism:
Homo sapiens (Human)
Description:
P25774
Residue:
331
  
Inhibitor
Name:
BDBM19881
Synonyms:
N-(cyanomethyl)-4-methyl-2-{3-[3-(piperazin-1-yl)phenyl]phenyl}pentanamide | Nonpeptidic Biaryl Nitrile Compound, 43
Type:
Small organic molecule
Emp. Form.:
C24H30N4O
Mol. Mass.:
390.5212
SMILES:
CC(C)CC(C(=O)NCC#N)c1cccc(c1)-c1cccc(c1)N1CCNCC1
:
Substrate
Name:
BDBM19490
Synonyms:
Cbz-Val-Val-Arg-AMC Z-Val-Val-Arg-AMC
Type:
Emp. Form.:
Mol. Mass.:
SMILES:
: