Target
Cathepsin S
Ligand
BDBM19890
Substrate
BDBM19490
Meas. Tech.
Enzyme Inhibition Assay
IC50
2364±n/a nM
Citation
 Robichaud, JOballa, RPrasit, PFalgueyret, JPPercival, MDWesolowski, GRodan, SBKimmel, DJohnson, CBryant, CVenkatraman, SSetti, EMendonca, RPalmer, JT A novel class of nonpeptidic biaryl inhibitors of human cathepsin K. J Med Chem 46:3709-27 (2003)  
Target
Name:
Cathepsin S
Synonyms:
CATS_HUMAN Cathepsin S (Cat S) | cathepsin S preproprotein
Type:
Protein
Mol. Mass.:
37507.38
Organism:
Homo sapiens (Human)
Description:
P25774
Residue:
331
  
Inhibitor
Name:
BDBM19890
Synonyms:
(2R)-N-(cyanomethyl)-4-methyl-2-(3-{4-[4-(2-oxopropyl)piperazin-1-yl]phenyl}phenyl)pentanamide | Nonpeptidic Biaryl Nitrile Compound, 11
Type:
Small organic molecule
Emp. Form.:
C27H34N4O2
Mol. Mass.:
446.5845
SMILES:
CC(C)C[C@@H](C(=O)NCC#N)c1cccc(c1)-c1ccc(cc1)N1CCN(CC(C)=O)CC1
:
Substrate
Name:
BDBM19490
Synonyms:
Cbz-Val-Val-Arg-AMC Z-Val-Val-Arg-AMC
Type:
Emp. Form.:
Mol. Mass.:
SMILES:
: